BDBM50100975 CHEMBL100838
SMILES C[C@H](CNc1ncc(C)n(CC(=O)NCc2ccc3[nH]cnc3c2)c1=O)c1ccccc1
InChI Key InChIKey=PDWZKMOQJPHUIY-UHFFFAOYSA-N
Data  1 KI
  Tab Delimited (TSV)   2D SDfile   Computed 3D by Vconf -m prep SDfile
Find this compound or compounds like it in BindingDB:
Activity Spreadsheet -- Enzyme Inhibition Constant Data from BindingDB
Found 1 hit for monomerid = 50100975
TargetProthrombin(Homo sapiens (Human))
Corvas International
Curated by ChEMBL
LigandPNGBDBM50100975(CHEMBL100838)
Affinity DataKi:  9.30nM. Assay description: In vitro inhibitory activity against human Thrombin (FIIa) cleavage of the chromogenic substrate
In DepthDetails ArticlePubMed