BDBM50100977 3,4-dichloro-phenylbiguanide::CHEMBL41433::N-(3,4-dichlorophenyl)imidodicarbonimidic diamide
SMILES NC(=N)N=C(N)Nc1ccc(Cl)c(Cl)c1
InChI Key InChIKey=ZJAWVBLMRPEUPW-UHFFFAOYSA-N
Data  1 IC50  1 EC50
  Tab Delimited (TSV)   2D SDfile   Computed 3D by Vconf -m prep SDfile
Find this compound or compounds like it in BindingDB:
Activity Spreadsheet -- Enzyme Inhibition Constant Data from BindingDB
Found 2 hits for monomerid = 50100977
TargetTrace amine-associated receptor 5(Mus musculus)
University Of Genoa
Curated by ChEMBL
LigandPNGBDBM50100977(3,4-dichloro-phenylbiguanide | CHEMBL41433 | N-(3,...)
Affinity DataEC50: >1.00E+4nM. Assay description: Agonist activity at mouse TAAR5 expressed in HEK293 cells assessed as cAMP accumulation after 20 mins by BRET assay
In DepthDetails ArticlePubMed
TargetIntegrin alpha-V/beta-3(Homo sapiens (Human))
Chinese Academy Of Medical Sciences And Peking Union Medical College
Curated by ChEMBL
LigandPNGBDBM50100977(3,4-dichloro-phenylbiguanide | CHEMBL41433 | N-(3,...)
Affinity DataIC50:  3.85E+4nM. Assay description: Inhibition of integrin alphavbeta3 mediated cell adhesion of human M21 cells to vitronectiin
In DepthDetails ArticlePubMed