BDBM50101415 CHEMBL306089::[2-(1H-Indol-3-yl)-1-methoxymethyl-1-(1-phenyl-ethylcarbamoyl)-ethyl]-carbamic acid benzofuran-2-ylmethyl ester
SMILES COC[C@](Cc1c[nH]c2ccccc12)(NC(=O)OCc1cc2ccccc2o1)C(=O)N[C@@H](C)c1ccccc1
InChI Key InChIKey=NYRRFZUUPVZXQG-BGOLNKOXSA-N
Data  1 IC50
  Tab Delimited (TSV)   2D SDfile   Computed 3D by Vconf -m prep SDfile
Find this compound or compounds like it in BindingDB:
Activity Spreadsheet -- Enzyme Inhibition Constant Data from BindingDB
Found 1 hit for monomerid = 50101415
TargetSubstance-P receptor(Homo sapiens (Human))
Cambridge University Forvie Site
Curated by ChEMBL
LigandPNGBDBM50101415(CHEMBL306089 | [2-(1H-Indol-3-yl)-1-methoxymethyl-...)
Affinity DataIC50:  0.700nM. Assay description: Inhibition of specific binding at tachykinin receptor 1
In DepthDetails ArticlePubMed