BDBM50102057 3-[2-(5-Bromo-2-chloro-phenyl)-ethyl]-piperidine; hydrochloride::CHEMBL539764
SMILES Clc1ccc(Br)cc1CCC1CCCNC1
InChI Key InChIKey=DODOBJJBECRINB-UHFFFAOYSA-N
Data  1 IC50
  Tab Delimited (TSV)   2D SDfile   Computed 3D by Vconf -m prep SDfile
Find this compound or compounds like it in BindingDB:
Activity Spreadsheet -- Enzyme Inhibition Constant Data from BindingDB
Found 1 hit for monomerid = 50102057
TargetPhospho-N-acetylmuramoyl-pentapeptide-transferase(Escherichia coli (strain K12))
Pharmacia
Curated by ChEMBL
LigandPNGBDBM50102057(3-[2-(5-Bromo-2-chloro-phenyl)-ethyl]-piperidine; ...)
Affinity DataIC50:  1.85E+5nM. Assay description: Inhibitory activity against accumulation of [14C]-labeled Linezolid within wild-type Escherichia coli K12 cells
In DepthDetails ArticlePubMed