BDBM50103293 3-[4-(2-Isopropyl-phenylsulfanyl)-3-nitro-phenyl]-1-(4-methyl-piperazin-1-yl)-propenone::CHEMBL99230
SMILES CC(C)c1ccccc1Sc1ccc(\C=C\C(=O)N2CCN(C)CC2)cc1[N+]([O-])=O
InChI Key InChIKey=HVZJOWMEYSKFNV-PKNBQFBNSA-N
Data  1 IC50
  Tab Delimited (TSV)   2D SDfile   Computed 3D by Vconf -m prep SDfile
Find this compound or compounds like it in BindingDB:
Activity Spreadsheet -- Enzyme Inhibition Constant Data from BindingDB
Found 1 hit for monomerid = 50103293
TargetIntegrin alpha-L/Integrin beta-2/Intercellular adhesion molecule 1(Homo sapiens (Human))
Abbott Laboratories
Curated by ChEMBL
LigandPNGBDBM50103293(3-[4-(2-Isopropyl-phenylsulfanyl)-3-nitro-phenyl]-...)
Affinity DataIC50:  130nM. Assay description: Ability to antagonise the Leukocyte function-associated Antigen-1/ Intracellular Adhesion molecule-1 interaction (LFA-1/ICAM-1)
In DepthDetails ArticlePubMed