BDBM50103303 4-{3-[4-(2-Isopropyl-phenylsulfanyl)-3-nitro-phenyl]-acryloyl}-piperazine-1,3-dicarboxylic acid 1-methyl ester::CHEMBL329509
SMILES COC(=O)N1CCN(C(C1)C(O)=O)C(=O)\C=C\c1ccc(Sc2ccccc2C(C)C)c(c1)[N+]([O-])=O
InChI Key InChIKey=YDDSCHDADLMSAK-PKNBQFBNSA-N
Data  1 IC50
  Tab Delimited (TSV)   2D SDfile   Computed 3D by Vconf -m prep SDfile
Find this compound or compounds like it in BindingDB:
Activity Spreadsheet -- Enzyme Inhibition Constant Data from BindingDB
Found 1 hit for monomerid = 50103303
TargetIntegrin alpha-L/Integrin beta-2/Intercellular adhesion molecule 1(Homo sapiens (Human))
Abbott Laboratories
Curated by ChEMBL
LigandPNGBDBM50103303(4-{3-[4-(2-Isopropyl-phenylsulfanyl)-3-nitro-pheny...)
Affinity DataIC50:  130nM. Assay description: Ability to antagonise the Leukocyte function-associated Antigen-1/ Intracellular Adhesion molecule-1 interaction (LFA-1/ICAM-1)
In DepthDetails ArticlePubMed