BDBM50104197 CHEMBL3594123
SMILES Fc1ccccc1C1NC(=O)c2cccnc2N1
InChI Key InChIKey=OFUNSZSTCICZOT-UHFFFAOYSA-N
Data  1 IC50
  Tab Delimited (TSV)   2D SDfile   Computed 3D by Vconf -m prep SDfile
Find this compound or compounds like it in BindingDB:
Activity Spreadsheet -- Enzyme Inhibition Constant Data from BindingDB
Found 1 hit for monomerid = 50104197
TargetPoly [ADP-ribose] polymerase tankyrase-2(Homo sapiens (Human))
University Of Oulu
Curated by ChEMBL
LigandPNGBDBM50104197(CHEMBL3594123)
Affinity DataIC50:  6.30E+4nM. Assay description: Inhibition of human TNKS2 (956 to 1161 and 873 to 1161) using 500 nM NAD substrate after 20 mins incubation by fluorescence assay
In DepthDetails ArticlePubMed