BDBM50104883 CHEMBL3597616
SMILES Cc1c(CC(O)=O)c2cccc(C#Cc3ccc(OCCCCc4cccc(Cl)c4C)cc3)c2n1CC(O)=O
InChI Key InChIKey=NDHNPJAOYJVUSM-UHFFFAOYSA-N
Data  2 IC50
  Tab Delimited (TSV)   2D SDfile   Computed 3D by Vconf -m prep SDfile
Find this compound or compounds like it in BindingDB:
Activity Spreadsheet -- Enzyme Inhibition Constant Data from BindingDB
Found 2 hits for monomerid = 50104883
TargetCysteinyl leukotriene receptor 2(Homo sapiens (Human))
Setsunan University
Curated by ChEMBL
LigandPNGBDBM50104883(CHEMBL3597616)
Affinity DataIC50:  0.890nM. Assay description: Antagonist activity at human CysLT2 expressed in HEK293 cells assessed as inhibition of LTD4-induced calcium mobilization preincubated for 30 mins pr...
In DepthDetails ArticlePubMed
TargetCysteinyl leukotriene receptor 1(Homo sapiens (Human))
Setsunan University
Curated by ChEMBL
LigandPNGBDBM50104883(CHEMBL3597616)
Affinity DataIC50:  0.470nM. Assay description: Antagonist activity at human CysLT1 expressed in CHOK1 cells assessed as inhibition of LTD4-induced calcium mobilization preincubated for 30 mins pri...
In DepthDetails ArticlePubMed