BDBM50105189 4-[4-(Morpholine-4-carbonyl)-phenoxy]-thieno[2,3-c]pyridine-2-carboxylic acid amide::CHEMBL117367
SMILES NC(=O)c1cc2c(Oc3ccc(cc3)C(=O)N3CCOCC3)cncc2s1
InChI Key InChIKey=ZGVWEAXBQBPRNR-UHFFFAOYSA-N
Data  3 IC50
  Tab Delimited (TSV)   2D SDfile   Computed 3D by Vconf -m prep SDfile
Find this compound or compounds like it in BindingDB:
Activity Spreadsheet -- Enzyme Inhibition Constant Data from BindingDB
Found 3 hits for monomerid = 50105189
TargetIntercellular adhesion molecule 1(Homo sapiens (Human))
Abbott Laboratories
Curated by ChEMBL
LigandPNGBDBM50105189(4-[4-(Morpholine-4-carbonyl)-phenoxy]-thieno[2,3-c...)
Affinity DataIC50:  830nM. Assay description: Inhibition of intercellular adhesion molecule-1 (ICAM1) in human endothelial cells
In DepthDetails ArticlePubMed
TargetVascular cell adhesion protein 1(Homo sapiens (Human))
Abbott Laboratories
Curated by ChEMBL
LigandPNGBDBM50105189(4-[4-(Morpholine-4-carbonyl)-phenoxy]-thieno[2,3-c...)
Affinity DataIC50: >1.00E+3nM. Assay description: Inhibition of VCAM-1 in human endothelial cells
In DepthDetails ArticlePubMed
TargetE-selectin(Homo sapiens (Human))
Abbott Laboratories
Curated by ChEMBL
LigandPNGBDBM50105189(4-[4-(Morpholine-4-carbonyl)-phenoxy]-thieno[2,3-c...)
Affinity DataIC50:  870nM. Assay description: Inhibition of selectin E in human endothelial cells
In DepthDetails ArticlePubMed