BDBM50105625 CHEMBL3597456
SMILES Cl.NC1CCc2cccc(-c3ccncc3)c2CC1=O
InChI Key InChIKey=DEXUXZGVPJZEIA-UHFFFAOYSA-N
Data  1 KI
  Tab Delimited (TSV)   2D SDfile   Computed 3D by Vconf -m prep SDfile
Find this compound or compounds like it in BindingDB:
Activity Spreadsheet -- Enzyme Inhibition Constant Data from BindingDB
Found 1 hit for monomerid = 50105625
TargetAminopeptidase N(Sus scrofa (Pig))
Universit£
Curated by ChEMBL
LigandPNGBDBM50105625(CHEMBL3597456)
Affinity DataKi:  3nM. Assay description: Inhibition of porcine kidney APN assessed as decrease in p-nitroanilide release using L-leucine-p-nitroanilide as substrate by spectrophotometric ana...
In DepthDetails ArticlePubMed