BDBM50105934 2-(6-Amino-purin-7-ylmethoxy)-ethanol::CHEMBL126093
SMILES Nc1ncnc2ncn(COCCO)c12
InChI Key InChIKey=UNHDLQCUCJXTBL-UHFFFAOYSA-N
Data  1 KI
  Tab Delimited (TSV)   2D SDfile   Computed 3D by Vconf -m prep SDfile
Find this compound or compounds like it in BindingDB:
Activity Spreadsheet -- Enzyme Inhibition Constant Data from BindingDB
Found 1 hit for monomerid = 50105934
TargetAdenosine deaminase(Bos taurus (bovine))
Academia Sinica
Curated by ChEMBL
LigandPNGBDBM50105934(2-(6-Amino-purin-7-ylmethoxy)-ethanol | CHEMBL1260...)
Affinity DataKi:  8.30E+3nM. Assay description: Inhibitory activity against adenosine deaminase
In DepthDetails ArticlePubMed