BDBM50107476 1-[(S)-2-((S)-Naphthalene-2-sulfonylamino)-3-phenyl-propionyl]-pyrrolidine-2-carboxylic acid (4-guanidino-butyl)-amide::CHEMBL428818
SMILES NC(=N)NCCCCNC(=O)[C@@H]1CCCN1C(=O)[C@@H](Cc1ccccc1)NS(=O)(=O)c1ccc2ccccc2c1
InChI Key InChIKey=ATZXVDFURGHGDC-FTJBHMTQSA-N
Data  1 IC50
  Tab Delimited (TSV)   2D SDfile   Computed 3D by Vconf -m prep SDfile
Find this compound or compounds like it in BindingDB:
Activity Spreadsheet -- Enzyme Inhibition Constant Data from BindingDB
Found 1 hit for monomerid = 50107476
TargetProthrombin(Homo sapiens (Human))
Bristol-Myers Squibb Pharmaceutical Research Institute
Curated by ChEMBL
LigandPNGBDBM50107476(1-[(S)-2-((S)-Naphthalene-2-sulfonylamino)-3-pheny...)
Affinity DataIC50:  1.40E+3nM. Assay description: In vitro inhibitory activity against hydrolysis of human alpha thrombin
In DepthDetails ArticlePubMed