BDBM50107835 CHEMBL3601011
SMILES Clc1ccc(cc1)-c1ccc(nc1)C#Cc1ccc(NCCN2CCCC2)cc1
InChI Key InChIKey=PUUSAFFMWKKHNK-UHFFFAOYSA-N
Data  1 IC50
  Tab Delimited (TSV)   2D SDfile   Computed 3D by Vconf -m prep SDfile
Find this compound or compounds like it in BindingDB:
Activity Spreadsheet -- Enzyme Inhibition Constant Data from BindingDB
Found 1 hit for monomerid = 50107835
TargetMelanin-concentrating hormone receptor 1(Homo sapiens (Human))
Boehringer Ingelheim Pharma
Curated by ChEMBL
LigandPNGBDBM50107835(CHEMBL3601011)
Affinity DataIC50:  5nM. Assay description: Displacement of [125I]-MCH from human MCHR1 expressed in CHO/Galpha16 cell membranes by scintillation counting method
In DepthDetails ArticlePubMed