BDBM50108073 4'-{[3-(4-Cyano-benzyl)-3H-imidazol-4-ylmethyl]-amino}-[1,1';2',1'']terphenyl-3-carboxylic acid 24(FTI-2312)::CHEMBL55427
SMILES OC(=O)c1cccc(c1)-c1ccc(NCc2cncn2Cc2ccc(cc2)C#N)cc1-c1ccccc1
InChI Key InChIKey=LANNGAZONSVWID-UHFFFAOYSA-N
Data  2 IC50
  Tab Delimited (TSV)   2D SDfile   Computed 3D by Vconf -m prep SDfile
Find this compound or compounds like it in BindingDB:
Activity Spreadsheet -- Enzyme Inhibition Constant Data from BindingDB
Found 2 hits for monomerid = 50108073
TargetDimer of Protein farnesyltransferase subunit beta(Homo sapiens (Human))
Yale University
Curated by ChEMBL
LigandPNGBDBM50108073(4'-{[3-(4-Cyano-benzyl)-3H-imidazol-4-ylmethyl]-am...)
Affinity DataIC50:  430nM. Assay description: Inhibition of farnesyltransferase from human Burkitt lymphoma (Daudi) cells
In DepthDetails ArticlePubMed
LigandPNGBDBM50108073(4'-{[3-(4-Cyano-benzyl)-3H-imidazol-4-ylmethyl]-am...)
Affinity DataIC50:  4.40E+3nM. Assay description: Inhibition of partially purified Geranylgeranyl transferase type I (GGTase-I) from human Burkitt lymphoma (Daudi) cells
In DepthDetails ArticlePubMed