BDBM50108937 CHEMBL3597063
SMILES COC(=O)C1=C(C[C@H](N([C@@H]1c1ccc(Cl)cc1)c1ccc(Br)cc1)c1ccc(Cl)cc1)Nc1ccc(Br)cc1
InChI Key InChIKey=BKWIEBMTFUKWGR-MFMCTBQISA-N
Data  2 IC50
  Tab Delimited (TSV)   2D SDfile   Computed 3D by Vconf -m prep SDfile
Find this compound or compounds like it in BindingDB:
Activity Spreadsheet -- Enzyme Inhibition Constant Data from BindingDB
Found 2 hits for monomerid = 50108937
TargetAcetylcholinesterase(Homo sapiens (Human))
Visva-Bharati (A Central University)
Curated by ChEMBL
LigandPNGBDBM50108937(CHEMBL3597063)
Affinity DataIC50:  8.80E+5nM. Assay description: Inhibition of human acetylcholinesterase using ATCI/DTNB as substrate preincubated for 30 mins followed by substrate addition measured for 60 mins by...
In DepthDetails ArticlePubMed
TargetAcetylcholinesterase(Homo sapiens (Human))
Visva-Bharati (A Central University)
Curated by ChEMBL
LigandPNGBDBM50108937(CHEMBL3597063)
Affinity DataIC50:  8.80E+5nM. Assay description: Inhibition of human acetylcholinesterase using ATCI/DTNB as substrate preincubated for 30 mins followed by substrate addition measured for 60 mins by...
In DepthDetails ArticlePubMed