BDBM50108946 CHEMBL3597009
SMILES CCOC(=O)C1=C(C[C@H](N([C@@H]1c1ccccc1)c1ccc(OC)cc1)c1ccccc1)Nc1ccc(OC)cc1
InChI Key InChIKey=JKNRDZFBYLLNGC-CQTOTRCISA-N
Data  2 IC50
  Tab Delimited (TSV)   2D SDfile   Computed 3D by Vconf -m prep SDfile
Find this compound or compounds like it in BindingDB:
Activity Spreadsheet -- Enzyme Inhibition Constant Data from BindingDB
Found 2 hits for monomerid = 50108946
TargetAcetylcholinesterase(Homo sapiens (Human))
Visva-Bharati (A Central University)
Curated by ChEMBL
LigandPNGBDBM50108946(CHEMBL3597009)
Affinity DataIC50:  2.25E+6nM. Assay description: Inhibition of human acetylcholinesterase using ATCI/DTNB as substrate preincubated for 30 mins followed by substrate addition measured for 60 mins by...
In DepthDetails ArticlePubMed
TargetAcetylcholinesterase(Homo sapiens (Human))
Visva-Bharati (A Central University)
Curated by ChEMBL
LigandPNGBDBM50108946(CHEMBL3597009)
Affinity DataIC50:  2.25E+6nM. Assay description: Inhibition of human acetylcholinesterase using ATCI/DTNB as substrate preincubated for 30 mins followed by substrate addition measured for 60 mins by...
In DepthDetails ArticlePubMed