BDBM50109179 4-[3-(3-{3-[4-(3-Hydroxy-phenyl)-piperidin-1-yl]-propyl}-ureido)-phenyl]-2,6-dimethyl-1,4-dihydro-pyridine-3,5-dicarboxylic acid dimethyl ester::CHEMBL126618
SMILES COC(=O)C1C(C(C(=O)OC)=C(C)N=C1C)c1cccc(NC(=O)NCCCN2CCC(CC2)c2cccc(O)c2)c1
InChI Key InChIKey=YVBSRVGLIJMMAX-UHFFFAOYSA-N
Data  1 KI
  Tab Delimited (TSV)   2D SDfile   Computed 3D by Vconf -m prep SDfile
Find this compound or compounds like it in BindingDB:
Activity Spreadsheet -- Enzyme Inhibition Constant Data from BindingDB
Found 1 hit for monomerid = 50109179
TargetNeuropeptide Y receptor type 1(Homo sapiens (Human))
Pharmaceutical Research Institute
Curated by ChEMBL
LigandPNGBDBM50109179(4-[3-(3-{3-[4-(3-Hydroxy-phenyl)-piperidin-1-yl]-p...)
Affinity DataKi:  2.70nM. Assay description: Inhibition of binding of [125I]-PYY radioligand to human neuropeptide Y1 receptor in SK-N-MC cell membrane
In DepthDetails ArticlePubMed