BDBM50113020 (2R,4S)-1-[4-(Biphenyl-2-ylmethoxy)-benzenesulfonyl]-4-hydroxy-piperidine-2-carboxylic acid hydroxyamide::CHEMBL282094
SMILES ONC(=O)[C@H]1C[C@@H](O)CCN1S(=O)(=O)c1ccc(OCc2ccccc2-c2ccccc2)cc1
InChI Key InChIKey=HLNRKJGRBAIQKZ-GBXCKJPGSA-N
Data  2 IC50
  Tab Delimited (TSV)   2D SDfile   Computed 3D by Vconf -m prep SDfile
Find this compound or compounds like it in BindingDB:
Activity Spreadsheet -- Enzyme Inhibition Constant Data from BindingDB
Found 2 hits for monomerid = 50113020
LigandPNGBDBM50113020((2R,4S)-1-[4-(Biphenyl-2-ylmethoxy)-benzenesulfony...)
Affinity DataIC50: >3.30E+4nM. Assay description: Inhibitory concentration against recombinant tumor necrosis factor alpha converting enzyme
In DepthDetails ArticlePubMed
LigandPNGBDBM50113020((2R,4S)-1-[4-(Biphenyl-2-ylmethoxy)-benzenesulfony...)
Affinity DataIC50:  67nM. Assay description: Inhibitory concentration against recombinant tumor necrosis factor alpha converting enzyme
In DepthDetails ArticlePubMed