BDBM50113150 (1E)-N'-(4-bromophenyl)-N-(3-chlorophenyl)-2-oxopropanehydrazonamide::CHEMBL69686
SMILES CC(=O)C(Nc1cccc(Cl)c1)=NNc1ccc(Br)cc1
InChI Key InChIKey=FGACSPJTLMBVMZ-UHFFFAOYSA-N
Data  1 KI
  Tab Delimited (TSV)   2D SDfile   Computed 3D by Vconf -m prep SDfile
Find this compound or compounds like it in BindingDB:
Activity Spreadsheet -- Enzyme Inhibition Constant Data from BindingDB
Found 1 hit for monomerid = 50113150
TargetCorticotropin-releasing factor receptor 1(Homo sapiens (Human))
TBA
Curated by ChEMBL
LigandPNGBDBM50113150((1E)-N'-(4-bromophenyl)-N-(3-chlorophenyl)-2-oxopr...)
Affinity DataKi:  1.46E+3nM. Assay description: Binding affinity against human Corticotropin releasing factor receptor 1
In DepthDetails ArticlePubMed