BDBM50113153 (1E)-N'-(2-methylphenyl)-N-(3-methylphenyl)-2-oxopropanehydrazonamide::CHEMBL67394
SMILES CC(=O)C(Nc1cccc(C)c1)=NNc1ccccc1C
InChI Key InChIKey=CWYKKCUNNMVXSP-UHFFFAOYSA-N
Data  1 KI
  Tab Delimited (TSV)   2D SDfile   Computed 3D by Vconf -m prep SDfile
Find this compound or compounds like it in BindingDB:
Activity Spreadsheet -- Enzyme Inhibition Constant Data from BindingDB
Found 1 hit for monomerid = 50113153
TargetCorticotropin-releasing factor receptor 1(Homo sapiens (Human))
TBA
Curated by ChEMBL
LigandPNGBDBM50113153((1E)-N'-(2-methylphenyl)-N-(3-methylphenyl)-2-oxop...)
Affinity DataKi:  526nM. Assay description: Binding affinity against human Corticotropin releasing factor receptor 1
In DepthDetails ArticlePubMed