BDBM50113184 (1E)-N-(3-chlorophenyl)-N'-(2-nitrophenyl)-2-oxopropanehydrazonamide::CHEMBL67121
SMILES CC(=O)C([N-]c1cccc(Cl)c1)=[NH+]Nc1ccccc1[N+]([O-])=O
InChI Key InChIKey=MJMCCSWDAXJWKZ-UHFFFAOYSA-O
Data  1 KI
  Tab Delimited (TSV)   2D SDfile   Computed 3D by Vconf -m prep SDfile
Find this compound or compounds like it in BindingDB:
Activity Spreadsheet -- Enzyme Inhibition Constant Data from BindingDB
Found 1 hit for monomerid = 50113184
TargetCorticotropin-releasing factor receptor 1(Homo sapiens (Human))
TBA
Curated by ChEMBL
LigandPNGBDBM50113184((1E)-N-(3-chlorophenyl)-N'-(2-nitrophenyl)-2-oxopr...)
Affinity DataKi:  51nM. Assay description: Binding affinity against human Corticotropin releasing factor receptor 1
In DepthDetails ArticlePubMed