BDBM50113189 (1E)-N'-(2-chlorophenyl)-N-(3-fluorophenyl)-2-oxopropanehydrazonamide::CHEMBL307795
SMILES CC(=O)C(Nc1cccc(F)c1)=NNc1ccccc1Cl
InChI Key InChIKey=QUZRFJLENPRXHQ-UHFFFAOYSA-N
Data  1 KI
  Tab Delimited (TSV)   2D SDfile   Computed 3D by Vconf -m prep SDfile
Find this compound or compounds like it in BindingDB:
Activity Spreadsheet -- Enzyme Inhibition Constant Data from BindingDB
Found 1 hit for monomerid = 50113189
TargetCorticotropin-releasing factor receptor 1(Homo sapiens (Human))
TBA
Curated by ChEMBL
LigandPNGBDBM50113189((1E)-N'-(2-chlorophenyl)-N-(3-fluorophenyl)-2-oxop...)
Affinity DataKi:  43nM. Assay description: Binding affinity against human Corticotropin releasing factor receptor 1
In DepthDetails ArticlePubMed