BDBM50114070 CHEMBL3605540
SMILES CCn1c(nc2ccc(cc12)C(F)(F)F)[C@@H](C)NS(=O)(=O)c1c(F)cc(F)cc1F
InChI Key InChIKey=MLWKTXXUFQXJGA-SECBINFHSA-N
Data  1 EC50
  Tab Delimited (TSV)   2D SDfile   Computed 3D by Vconf -m prep SDfile
Find this compound or compounds like it in BindingDB:
Activity Spreadsheet -- Enzyme Inhibition Constant Data from BindingDB
Found 1 hit for monomerid = 50114070
TargetSphingosine 1-phosphate receptor 1(Homo sapiens (Human))
Astrazeneca
Curated by ChEMBL
LigandPNGBDBM50114070(CHEMBL3605540)
Affinity DataEC50:  240nM. Assay description: Antagonist activity against human S1P1 receptor expressed in human U2OS cells co-expressing GFP assessed as inhibition of S1P-induced receptor transl...
In DepthDetails ArticlePubMed