BDBM50115551 CHEMBL108959::{4-[(4-Bromo-phenyl)-ethoxyimino-methyl]-4'-methyl-[1,4']bipiperidinyl-1'-yl}-pyridin-3-yl-methanone
SMILES CCO\N=C(\C1CCN(CC1)C1(C)CCN(CC1)C(=O)c1cccnc1)c1ccc(Br)cc1
InChI Key InChIKey=OXWJECATMBDYIK-RMLRFSFXSA-N
Data  1 KI
  Tab Delimited (TSV)   2D SDfile   Computed 3D by Vconf -m prep SDfile
Find this compound or compounds like it in BindingDB:
Activity Spreadsheet -- Enzyme Inhibition Constant Data from BindingDB
Found 1 hit for monomerid = 50115551
TargetC-C chemokine receptor type 5(Mus musculus)
Schering-Plough Research Institute
Curated by ChEMBL
LigandPNGBDBM50115551(CHEMBL108959 | {4-[(4-Bromo-phenyl)-ethoxyimino-me...)
Affinity DataKi: >30nM. Assay description: Inhibition of RANTES binding to Chemokine receptor type 5 receptor from NIH 3T3 cells
In DepthDetails ArticlePubMed