BDBM50116529 3-{Methyl-[3-(4-thiophen-2-ylmethyl-phenoxy)-propyl]-amino}-propionic acid methyl ester::CHEMBL116571
SMILES COC(=O)CCN(C)CCCOc1ccc(Cc2cccs2)cc1
InChI Key InChIKey=NXZVXXACWZJUDZ-UHFFFAOYSA-N
Data  2 IC50
  Tab Delimited (TSV)   2D SDfile   Computed 3D by Vconf -m prep SDfile
Find this compound or compounds like it in BindingDB:
Activity Spreadsheet -- Enzyme Inhibition Constant Data from BindingDB
Found 2 hits for monomerid = 50116529
TargetLeukotriene A-4 hydrolase(Homo sapiens (Human))
Pfizer
Curated by ChEMBL
LigandPNGBDBM50116529(3-{Methyl-[3-(4-thiophen-2-ylmethyl-phenoxy)-propy...)
Affinity DataIC50:  16nM. Assay description: Inhibition of human leukotriene A4 hydrolase (LTA-4).
In DepthDetails ArticlePubMed
TargetLeukotriene A-4 hydrolase(Homo sapiens (Human))
Pfizer
Curated by ChEMBL
LigandPNGBDBM50116529(3-{Methyl-[3-(4-thiophen-2-ylmethyl-phenoxy)-propy...)
Affinity DataIC50:  95nM. Assay description: Inhibition of human whole blood LTB-4 production (Leukotriene B-4).
In DepthDetails ArticlePubMed