BDBM50116544 2-{[3-(4-Benzyl-phenoxy)-propyl]-methyl-amino}-ethanesulfonic acid amide::CHEMBL421048
SMILES CN(CCCOc1ccc(Cc2ccccc2)cc1)CCS(N)(=O)=O
InChI Key InChIKey=OTPIPTVNDASPPG-UHFFFAOYSA-N
Data  2 IC50
  Tab Delimited (TSV)   2D SDfile   Computed 3D by Vconf -m prep SDfile
Find this compound or compounds like it in BindingDB:
Activity Spreadsheet -- Enzyme Inhibition Constant Data from BindingDB
Found 2 hits for monomerid = 50116544
TargetLeukotriene A-4 hydrolase(Homo sapiens (Human))
Pfizer
Curated by ChEMBL
LigandPNGBDBM50116544(2-{[3-(4-Benzyl-phenoxy)-propyl]-methyl-amino}-eth...)
Affinity DataIC50:  4nM. Assay description: Inhibition of human leukotriene A4 hydrolase (LTA-4).
In DepthDetails ArticlePubMed
TargetLeukotriene A-4 hydrolase(Homo sapiens (Human))
Pfizer
Curated by ChEMBL
LigandPNGBDBM50116544(2-{[3-(4-Benzyl-phenoxy)-propyl]-methyl-amino}-eth...)
Affinity DataIC50:  740nM. Assay description: Inhibition of human whole blood LTB-4 production (Leukotriene B-4).
In DepthDetails ArticlePubMed