BDBM50116834 5-Chloro-7-methoxy-2-methyl-1-(2-morpholin-4-yl-ethyl)-1H-indole-3-carboxylic acid ((R)-1,3,3-trimethyl-bicyclo[2.2.1]hept-2-yl)-amide::CHEMBL312093
SMILES COc1cc(Cl)cc2c(C(=O)N[C@@H]3C4(C)CCC(C4)C3(C)C)c(C)n(CCN3CCOCC3)c12
InChI Key InChIKey=BOXMLADZYBZPKU-DYDBGPTBSA-N
Data  1 KI
  Tab Delimited (TSV)   2D SDfile   Computed 3D by Vconf -m prep SDfile
Find this compound or compounds like it in BindingDB:
Activity Spreadsheet -- Enzyme Inhibition Constant Data from BindingDB
Found 1 hit for monomerid = 50116834
TargetCannabinoid receptor 2(Homo sapiens (Human))
Bristol-Myers Squibb
Curated by ChEMBL
LigandPNGBDBM50116834(5-Chloro-7-methoxy-2-methyl-1-(2-morpholin-4-yl-et...)
Affinity DataKi:  251nM. Assay description: Binding affinity against human CB2 receptor expressed in CHO cells by using WIN55,2122 Mesylate [5,73H] as Radioactive tracer
In DepthDetails ArticlePubMed