BDBM50116836 (S)-2-{[2-Methyl-1-(2-morpholin-4-yl-ethyl)-1H-indole-3-carbonyl]-amino}-3-phenyl-propionic acid methyl ester::CHEMBL431184
SMILES COC(=O)[C@H](Cc1ccccc1)NC(=O)c1c(C)n(CCN2CCOCC2)c2ccccc12
InChI Key InChIKey=BIGBNLVWLAWOLK-QFIPXVFZSA-N
Data  1 KI
  Tab Delimited (TSV)   2D SDfile   Computed 3D by Vconf -m prep SDfile
Find this compound or compounds like it in BindingDB:
Activity Spreadsheet -- Enzyme Inhibition Constant Data from BindingDB
Found 1 hit for monomerid = 50116836
TargetCannabinoid receptor 2(Homo sapiens (Human))
Bristol-Myers Squibb
Curated by ChEMBL
LigandPNGBDBM50116836((S)-2-{[2-Methyl-1-(2-morpholin-4-yl-ethyl)-1H-ind...)
Affinity DataKi:  250nM. Assay description: Binding affinity against human CB2 receptor expressed in CHO cells by using WIN55,2122 Mesylate [5,73H] as Radioactive tracer
In DepthDetails ArticlePubMed