BDBM50116849 7-Methoxy-1-(2-morpholin-4-yl-ethyl)-1H-indole-3-carboxylic acid (1,3,3-trimethyl-bicyclo[2.2.1]hept-2-yl)-amide::CHEMBL420939
SMILES COc1cccc2c(cn(CCN3CCOCC3)c12)C(=O)NC1C2(C)CCC(C2)C1(C)C
InChI Key InChIKey=VQGDMQICNRCQEH-UHFFFAOYSA-N
Data  1 KI
  Tab Delimited (TSV)   2D SDfile   Computed 3D by Vconf -m prep SDfile
Find this compound or compounds like it in BindingDB:
Activity Spreadsheet -- Enzyme Inhibition Constant Data from BindingDB
Found 1 hit for monomerid = 50116849
TargetCannabinoid receptor 2(Homo sapiens (Human))
Bristol-Myers Squibb
Curated by ChEMBL
LigandPNGBDBM50116849(7-Methoxy-1-(2-morpholin-4-yl-ethyl)-1H-indole-3-c...)
Affinity DataKi:  12nM. Assay description: Binding affinity against human CB2 receptor expressed in CHO cells by using WIN55,2122 Mesylate [5,73H] as Radioactive tracer
In DepthDetails ArticlePubMed