BDBM50116859 7-Methoxy-1-(2-morpholin-4-yl-ethyl)-1H-indole-3-carboxylic acid (2,2,5,5-tetramethyl-cyclohexyl)-amide::CHEMBL310431
SMILES COc1cccc2c(cn(CCN3CCOCC3)c12)C(=O)NC1CC(C)(C)CCC1(C)C
InChI Key InChIKey=NGZFHFGSCIGBSV-UHFFFAOYSA-N
Data  1 KI
  Tab Delimited (TSV)   2D SDfile   Computed 3D by Vconf -m prep SDfile
Find this compound or compounds like it in BindingDB:
Activity Spreadsheet -- Enzyme Inhibition Constant Data from BindingDB
Found 1 hit for monomerid = 50116859
TargetCannabinoid receptor 2(Homo sapiens (Human))
Bristol-Myers Squibb
Curated by ChEMBL
LigandPNGBDBM50116859(7-Methoxy-1-(2-morpholin-4-yl-ethyl)-1H-indole-3-c...)
Affinity DataKi:  22nM. Assay description: Binding affinity against human CB2 receptor expressed in CHO cells by using WIN55,2122 Mesylate [5,73H] as Radioactive tracer
In DepthDetails ArticlePubMed