BDBM50118241 CHEMBL3612505
SMILES CN(\N=C\c1cnn2ccc(nc12)-c1cccnc1)S(=O)(=O)c1cc(ccc1C)[N+]([O-])=O
InChI Key InChIKey=ZRKHDIABAALLSW-WSDLNYQXSA-N
Data  4 IC50
  Tab Delimited (TSV)   2D SDfile   Computed 3D by Vconf -m prep SDfile
Find this compound or compounds like it in BindingDB:
Activity Spreadsheet -- Enzyme Inhibition Constant Data from BindingDB
Found 4 hits for monomerid = 50118241
TargetCyclin-dependent kinase 7(Homo sapiens (Human))
The University Of Melbourne
Curated by ChEMBL
LigandPNGBDBM50118241(CHEMBL3612505)
Affinity DataIC50: >1.00E+4nM. Assay description: Inhibition of CDK7 (unknown origin) by radiometric assay
In DepthDetails ArticlePubMed
TargetCyclin-T1/Cyclin-dependent kinase 9(Homo sapiens (Human))
The University Of Melbourne
Curated by ChEMBL
LigandPNGBDBM50118241(CHEMBL3612505)
Affinity DataIC50:  209nM. Assay description: Inhibition of recombinant human CDK9/cyclin-T1 using H-YSPTSPSYSPTSPSYSPTSPS-KKKK-OH as substrate after 90 mins by luminescence assay
In DepthDetails ArticlePubMed
TargetReceptor-type tyrosine-protein kinase FLT3(Homo sapiens (Human))
The University Of Melbourne
Curated by ChEMBL
LigandPNGBDBM50118241(CHEMBL3612505)
Affinity DataIC50:  7.5nM. Assay description: Inhibition of FLT3 (unknown origin) using biotin-Glu-Gly-Pro-Trp-Leu-Glu-Glu-Glu-Glu-Glu-Ala-Tyr-Gly-Trp-Met-Asp-Phe-NH2 as substrate after 90 mins b...
In DepthDetails ArticlePubMed
TargetPhosphatidylinositol 4,5-bisphosphate 3-kinase catalytic subunit alpha isoform(Homo sapiens (Human))
The University Of Melbourne
Curated by ChEMBL
LigandPNGBDBM50118241(CHEMBL3612505)
Affinity DataIC50:  1.24E+3nM. Assay description: Inhibition of PI3Kalpha (unknown origin) by radiometric assay
In DepthDetails ArticlePubMed