BDBM50118905 2-{2-[7-Chloro-5-(2,3-dimethoxy-phenyl)-1-(3-hydroxy-2,2-dimethyl-propyl)-2-oxo-1,2,3,5-tetrahydro-benzo[e][1,4]oxazepin-3-yl]-acetylamino}-4-methyl-pentanoic acid::CHEMBL140570
SMILES COc1cccc([C@H]2O[C@H](CC(=O)NC(CC(C)C)C(O)=O)C(=O)N(CC(C)(C)CO)c3ccc(Cl)cc23)c1OC
InChI Key InChIKey=WNDWVXWDWVLVPA-GVCDQIDYSA-N
Data  1 IC50
  Tab Delimited (TSV)   2D SDfile   Computed 3D by Vconf -m prep SDfile
Find this compound or compounds like it in BindingDB:
Activity Spreadsheet -- Enzyme Inhibition Constant Data from BindingDB
Found 1 hit for monomerid = 50118905
TargetSqualene synthase(Homo sapiens (Human))
Takeda Chemical Industries
Curated by ChEMBL
LigandPNGBDBM50118905(2-{2-[7-Chloro-5-(2,3-dimethoxy-phenyl)-1-(3-hydro...)
Affinity DataIC50:  28nM. Assay description: Inhibition of squalene synthase from human hepatoma cells (HepG2)
In DepthDetails ArticlePubMed