BDBM50119334 CHEMBL101333::Cyclohexyl-{(S)-3-[4-hydroxy-4-(3-phenyl-propyl)-piperidin-1-ylmethyl]-4-phenyl-pyrrolidin-1-yl}-acetic acid benzyl ester
SMILES OC1(CCCc2ccccc2)CCN(C[C@H]2CN(C[C@@H]2c2ccccc2)[C@H](C2CCCCC2)C(=O)OCc2ccccc2)CC1
InChI Key InChIKey=MWARYVUQVJIHTP-YXWIYCFASA-N
Data  1 IC50
  Tab Delimited (TSV)   2D SDfile   Computed 3D by Vconf -m prep SDfile
Find this compound or compounds like it in BindingDB:
Activity Spreadsheet -- Enzyme Inhibition Constant Data from BindingDB
Found 1 hit for monomerid = 50119334
TargetC-C chemokine receptor type 5(Homo sapiens (Human))
Merck Research Laboratories
Curated by ChEMBL
LigandPNGBDBM50119334(CHEMBL101333 | Cyclohexyl-{(S)-3-[4-hydroxy-4-(3-p...)
Affinity DataIC50:  3.60nM. Assay description: In vitro binding affinity at CCR5 receptor in the presence of [125I]-MIP-1 alpha.
In DepthDetails ArticlePubMed