BDBM50120955 CHEMBL3621373
SMILES NC(=N)NCCC[C@@H]1NC(=O)[C@@H](CSCc2cccc(CSCCNC(=O)[C@H](Cc3ccccc3)NC(=O)[C@H](CCCNC(N)=N)NC(=O)[C@H](CS)NC1=O)c2)NC(=O)CC(c1ccccc1)c1ccccc1
InChI Key InChIKey=UDJQXCHEJWFOLC-JQJTXJFLSA-N
Data  1 EC50
  Tab Delimited (TSV)   2D SDfile   Computed 3D by Vconf -m prep SDfile
Find this compound or compounds like it in BindingDB:
Activity Spreadsheet -- Enzyme Inhibition Constant Data from BindingDB
Found 1 hit for monomerid = 50120955
TargetSolute carrier family 40 member 1(Homo sapiens (Human))
University Of California Los Angeles
Curated by ChEMBL
LigandPNGBDBM50120955(CHEMBL3621373)
Affinity DataEC50:  269nM. Assay description: Agonist activity at GFP-fused human FPN transfected in HEK293 cells assessed as protein degradation after 24 hrs by flow cytometric analysis
In DepthDetails ArticlePubMed