BDBM50121840 (R)-3-Cyclobutyl-2-((S)-3-(3-fluoro-phenyl)-4-{4-[3-(4-fluoro-phenyl)-propyl]-piperidin-1-ylmethyl}-pyrrolidin-1-yl)-propionic acid::(R)-3-cyclobutyl-2-((3S,4S)-3-(3-fluorophenyl)-4-((4-(3-(4-fluorophenyl)propyl)piperidin-1-yl)methyl)pyrrolidin-1-yl)propanoic acid::CHEMBL281607
SMILES OC(=O)[C@@H](CC1CCC1)N1C[C@H](CN2CCC(CCCc3ccc(F)cc3)CC2)[C@H](C1)c1cccc(F)c1
InChI Key InChIKey=WPQUSTXDJJWMBZ-LXLYTFERSA-N
Data  2 IC50
  Tab Delimited (TSV)   2D SDfile   Computed 3D by Vconf -m prep SDfile
Find this compound or compounds like it in BindingDB:
Activity Spreadsheet -- Enzyme Inhibition Constant Data from BindingDB
Found 2 hits for monomerid = 50121840
TargetC-C chemokine receptor type 5(Homo sapiens (Human))
Beijing University Of Technology
Curated by ChEMBL
LigandPNGBDBM50121840((R)-3-Cyclobutyl-2-((S)-3-(3-fluoro-phenyl)-4-{4-[...)
Affinity DataIC50:  0.800nM. Assay description: Displacement of [125I]MIP1alpha from human CCR5 expressed in CHO cells
In DepthDetails ArticlePubMed
TargetC-C chemokine receptor type 5(Homo sapiens (Human))
Beijing University Of Technology
Curated by ChEMBL
LigandPNGBDBM50121840((R)-3-Cyclobutyl-2-((S)-3-(3-fluoro-phenyl)-4-{4-[...)
Affinity DataIC50:  0.800nM. Assay description: Ability to displace [125I]- labeled MIP-1alpha from CCR5 receptor expressed on CHO cell membrane
In DepthDetails ArticlePubMed