BDBM50122413 4-(4-Benzyl-piperazin-1-yl)-1-phenyl-cyclohexanol::CHEMBL321776
SMILES OC1(CCC(CC1)N1CCN(Cc2ccccc2)CC1)c1ccccc1
InChI Key InChIKey=FBXZFVYZLQQUFO-UHFFFAOYSA-N
Data  1 IC50
  Tab Delimited (TSV)   2D SDfile   Computed 3D by Vconf -m prep SDfile
Find this compound or compounds like it in BindingDB:
Activity Spreadsheet -- Enzyme Inhibition Constant Data from BindingDB
Found 1 hit for monomerid = 50122413
Target5-hydroxytryptamine receptor 1A(Rattus norvegicus (rat))
Bristol-Myers Squibb Pharmaceutical Research Institute
Curated by ChEMBL
LigandPNGBDBM50122413(4-(4-Benzyl-piperazin-1-yl)-1-phenyl-cyclohexanol ...)
Affinity DataIC50:  460nM. Assay description: Inhibition of the 5-hydroxytryptamine 1A receptor in rat dorsal raphe
In DepthDetails ArticlePubMed