BDBM50122418 1-Benzo[1,3]dioxol-5-yl-4-[4-(2-fluoro-5-methoxy-benzyl)-piperazin-1-yl]-cyclohexanol::CHEMBL319132
SMILES COc1ccc(F)c(CN2CCN(CC2)C2CCC(O)(CC2)c2ccc3OCOc3c2)c1
InChI Key InChIKey=VQCLRBBNBBREIV-UHFFFAOYSA-N
Data  1 IC50
  Tab Delimited (TSV)   2D SDfile   Computed 3D by Vconf -m prep SDfile
Find this compound or compounds like it in BindingDB:
Activity Spreadsheet -- Enzyme Inhibition Constant Data from BindingDB
Found 1 hit for monomerid = 50122418
Target5-hydroxytryptamine receptor 1A(Rattus norvegicus (rat))
Bristol-Myers Squibb Pharmaceutical Research Institute
Curated by ChEMBL
LigandPNGBDBM50122418(1-Benzo[1,3]dioxol-5-yl-4-[4-(2-fluoro-5-methoxy-b...)
Affinity DataIC50:  0.75nM. Assay description: Inhibition of the 5-hydroxytryptamine 1A receptor in rat dorsal raphe
In DepthDetails ArticlePubMed