BDBM50122424 1-Benzo[1,3]dioxol-5-yl-4-[4-(4-chloro-benzyl)-piperazin-1-yl]-cyclohexanol::CHEMBL95536
SMILES OC1(CCC(CC1)N1CCN(Cc2ccc(Cl)cc2)CC1)c1ccc2OCOc2c1
InChI Key InChIKey=NZDPJFGBNFHAJF-UHFFFAOYSA-N
Data  1 IC50
  Tab Delimited (TSV)   2D SDfile   Computed 3D by Vconf -m prep SDfile
Find this compound or compounds like it in BindingDB:
Activity Spreadsheet -- Enzyme Inhibition Constant Data from BindingDB
Found 1 hit for monomerid = 50122424
Target5-hydroxytryptamine receptor 1A(Rattus norvegicus (rat))
Bristol-Myers Squibb Pharmaceutical Research Institute
Curated by ChEMBL
LigandPNGBDBM50122424(1-Benzo[1,3]dioxol-5-yl-4-[4-(4-chloro-benzyl)-pip...)
Affinity DataIC50:  79nM. Assay description: Inhibition of the 5-hydroxytryptamine 1A receptor in rat dorsal raphe
In DepthDetails ArticlePubMed