BDBM50123368 2-(8-Dimethylamino-5,6,7,8-tetrahydro-naphthalen-2-yl)-7-methoxy-6-oxazol-5-yl-1H-quinolin-4-one::CHEMBL357291
SMILES COc1cc2nc(cc(O)c2cc1-c1cnco1)-c1ccc2CCCC(N(C)C)c2c1
InChI Key InChIKey=MYASTKRFIDHEBN-UHFFFAOYSA-N
Data  1 IC50
  Tab Delimited (TSV)   2D SDfile   Computed 3D by Vconf -m prep SDfile
Find this compound or compounds like it in BindingDB:
Activity Spreadsheet -- Enzyme Inhibition Constant Data from BindingDB
Found 1 hit for monomerid = 50123368
TargetInosine-5'-monophosphate dehydrogenase 2(Homo sapiens (Human))
Bristol-Myers Squibb Pri
Curated by ChEMBL
LigandPNGBDBM50123368(2-(8-Dimethylamino-5,6,7,8-tetrahydro-naphthalen-2...)
Affinity DataIC50:  15nM. Assay description: Inhibitory activity against inosine monophosphate dehydrogenase IMPDH II
In DepthDetails ArticlePubMed