BDBM50123775 4-[2-(4-Chloro-phenyl)-ethenesulfonyl]-1-(1H-pyrrolo[3,2-c]pyridin-2-ylmethyl)-piperazin-2-one::CHEMBL157760
SMILES Clc1ccc(C=CS(=O)(=O)N2CCN(Cc3cc4cnccc4[nH]3)C(=O)C2)cc1
InChI Key InChIKey=UJWDYGUWYIFRRY-UHFFFAOYSA-N
Data  1 KI
  Tab Delimited (TSV)   2D SDfile   Computed 3D by Vconf -m prep SDfile
Find this compound or compounds like it in BindingDB:
Activity Spreadsheet -- Enzyme Inhibition Constant Data from BindingDB
Found 1 hit for monomerid = 50123775
TargetCoagulation factor X(Homo sapiens (Human))
Aventis Pharmaceuticals
Curated by ChEMBL
LigandPNGBDBM50123775(4-[2-(4-Chloro-phenyl)-ethenesulfonyl]-1-(1H-pyrro...)
Affinity DataKi:  48nM. Assay description: In vitro binding affinity for human Coagulation factor X
In DepthDetails ArticlePubMed