BDBM50124605 5-Allyl-7-bromo-10-methoxy-2,2,4-trimethyl-2,5-dihydro-1H-6-oxa-1-aza-chrysene::CHEMBL7817
SMILES COc1ccc(Br)c2OC(CC=C)c3c(ccc4NC(C)(C)C=C(C)c34)-c12
InChI Key InChIKey=YTLYEUJDSGNODP-UHFFFAOYSA-N
Data  2 KI  1 EC50
  Tab Delimited (TSV)   2D SDfile   Computed 3D by Vconf -m prep SDfile
Find this compound or compounds like it in BindingDB:
Activity Spreadsheet -- Enzyme Inhibition Constant Data from BindingDB
Found 3 hits for monomerid = 50124605
TargetGlucocorticoid receptor(Homo sapiens (Human))
Abbott Laboratories
Curated by ChEMBL
LigandPNGBDBM50124605(5-Allyl-7-bromo-10-methoxy-2,2,4-trimethyl-2,5-dih...)
Affinity DataKi:  4.10nM. Assay description: Binding affinity towards human glucocorticoid receptor (GR) was determined using [3H]-Dexamethasone as radioligand in SF-1 cells
In DepthDetails ArticlePubMed
TargetProgesterone receptor(Homo sapiens (Human))
Abbott Laboratories
Curated by ChEMBL
LigandPNGBDBM50124605(5-Allyl-7-bromo-10-methoxy-2,2,4-trimethyl-2,5-dih...)
Affinity DataKi: >5.00E+3nM. Assay description: Displacement of [3H]-progesterone from human Progesterone receptor A
In DepthDetails ArticlePubMed
TargetGlucocorticoid receptor(Homo sapiens (Human))
Abbott Laboratories
Curated by ChEMBL
LigandPNGBDBM50124605(5-Allyl-7-bromo-10-methoxy-2,2,4-trimethyl-2,5-dih...)
Affinity DataEC50:  59nM. Assay description: Inhibition of dihydrofolate reductase DHFR in Pneumocystis carinii.
In DepthDetails ArticlePubMed