BDBM50124660 (3-Cyclohexyl-ureido)-acetic acid tert-butyl ester::CHEMBL11448
SMILES CC(C)(C)OC(=O)CNC(=O)NC1CCCCC1
InChI Key InChIKey=PHDMZXJEOZGIES-UHFFFAOYSA-N
Data  2 IC50
  Tab Delimited (TSV)   2D SDfile   Computed 3D by Vconf -m prep SDfile
Find this compound or compounds like it in BindingDB:
Activity Spreadsheet -- Enzyme Inhibition Constant Data from BindingDB
Found 2 hits for monomerid = 50124660
TargetBifunctional epoxide hydrolase 2(Homo sapiens (Human))
The Pennsylvania State University
Curated by ChEMBL
LigandPNGBDBM50124660((3-Cyclohexyl-ureido)-acetic acid tert-butyl ester...)
Affinity DataIC50:  1.91E+4nM. Assay description: Inhibitory activity against human soluble epoxide hydrolase
In DepthDetails ArticlePubMed
TargetBifunctional epoxide hydrolase 2(Mus musculus (Mouse))
The Pennsylvania State University
Curated by ChEMBL
LigandPNGBDBM50124660((3-Cyclohexyl-ureido)-acetic acid tert-butyl ester...)
Affinity DataIC50:  4.37E+3nM. Assay description: Inhibitory activity against murine soluble epoxide hydrolase
In DepthDetails ArticlePubMed