BDBM50125420 5-[2-(4-Benzyl-phenoxy)-ethyl]-5H-imidazo[4,5-c]pyridine::CHEMBL14814
SMILES C(Cn1ccc2ncnc2c1)Oc1ccc(Cc2ccccc2)cc1
InChI Key InChIKey=WQQHDNYIFNAYIU-UHFFFAOYSA-N
Data  2 IC50
  Tab Delimited (TSV)   2D SDfile   Computed 3D by Vconf -m prep SDfile
Find this compound or compounds like it in BindingDB:
Activity Spreadsheet -- Enzyme Inhibition Constant Data from BindingDB
Found 2 hits for monomerid = 50125420
TargetLeukotriene A-4 hydrolase(Homo sapiens (Human))
Gyeongsang National University (Gnu)
Curated by ChEMBL
LigandPNGBDBM50125420(5-[2-(4-Benzyl-phenoxy)-ethyl]-5H-imidazo[4,5-c]py...)
Affinity DataIC50:  11nM. Assay description: Inhibition of human leukotriene A4 hydrolase
In DepthDetails ArticlePubMed
TargetLeukotriene A-4 hydrolase(Homo sapiens (Human))
Gyeongsang National University (Gnu)
Curated by ChEMBL
LigandPNGBDBM50125420(5-[2-(4-Benzyl-phenoxy)-ethyl]-5H-imidazo[4,5-c]py...)
Affinity DataIC50:  11nM. Assay description: In vitro inhibition of recombinant human leukotriene A4 hydrolase.
In DepthDetails ArticlePubMed