BDBM50125778 3-Methyl-1-phenyl-1,5,6,7-tetrahydro-1,2,4-triaza-s-indacen-8-ylamine::CHEMBL15043
SMILES Cc1nn(-c2ccccc2)c2c(N)c3CCCc3nc12
InChI Key InChIKey=WWBPCPFCRPQVPL-UHFFFAOYSA-N
Data  1 IC50
  Tab Delimited (TSV)   2D SDfile   Computed 3D by Vconf -m prep SDfile
Find this compound or compounds like it in BindingDB:
Activity Spreadsheet -- Enzyme Inhibition Constant Data from BindingDB
Found 1 hit for monomerid = 50125778
TargetAcetylcholinesterase(Rattus norvegicus (rat))
Universidade Federal Do Rio De Janeiro
Curated by ChEMBL
LigandPNGBDBM50125778(3-Methyl-1-phenyl-1,5,6,7-tetrahydro-1,2,4-triaza-...)
Affinity DataIC50:  3.22E+4nM. Assay description: Inhibitory activity against rat brain total Acetylcholinesterase (AChE) was determined using Ellman's method
In DepthDetails ArticlePubMed