BDBM50125782 3-Methyl-1-phenyl-6,7,8,9-tetrahydro-1H-1,2,10,11-tetraaza-cyclopenta[b]anthracen-5-ylamine::CHEMBL15664
SMILES Cc1nn(-c2ccccc2)c2nc3nc4CCCCc4c(N)c3cc12
InChI Key InChIKey=QIHOMOXYGPCBDW-UHFFFAOYSA-N
Data  3 IC50
  Tab Delimited (TSV)   2D SDfile   Computed 3D by Vconf -m prep SDfile
Find this compound or compounds like it in BindingDB:
Activity Spreadsheet -- Enzyme Inhibition Constant Data from BindingDB
Found 3 hits for monomerid = 50125782
TargetCarboxylic ester hydrolase(Rattus norvegicus (rat))
Universidade Federal Do Rio De Janeiro
Curated by ChEMBL
LigandPNGBDBM50125782(3-Methyl-1-phenyl-6,7,8,9-tetrahydro-1H-1,2,10,11-...)
Affinity DataIC50:  1.34E+5nM. Assay description: Inhibitory concentration against rat brain butyrylcholinesterase (BuChE) was determined using Ellman's method
In DepthDetails ArticlePubMed
TargetAcetylcholinesterase(Bos taurus (bovine))
Punjabi University
Curated by ChEMBL
LigandPNGBDBM50125782(3-Methyl-1-phenyl-6,7,8,9-tetrahydro-1H-1,2,10,11-...)
Affinity DataIC50:  6.40E+3nM. Assay description: Inhibition of bovine erythrocyte acetylcholinesterase using acetylthiocholine iodide as substrate after 15 mins by Ellman's method
In DepthDetails ArticlePubMed
TargetAcetylcholinesterase(Rattus norvegicus (rat))
Universidade Federal Do Rio De Janeiro
Curated by ChEMBL
LigandPNGBDBM50125782(3-Methyl-1-phenyl-6,7,8,9-tetrahydro-1H-1,2,10,11-...)
Affinity DataIC50:  6.39E+3nM. Assay description: Inhibitory activity against rat brain total Acetylcholinesterase (AChE) was determined using Ellman's method
In DepthDetails ArticlePubMed