BDBM50126138 CHEMBL3628938
SMILES CCCCC(C(=O)COc1c(F)c(F)cc(F)c1F)n1cc(nn1)[C@@](C)(NCc1ccc2ncsc2c1)C1CCCC1
InChI Key InChIKey=OQDQGSSUGQXEKZ-POYPGSECSA-N
Data  1 IC50
  Tab Delimited (TSV)   2D SDfile   Computed 3D by Vconf -m prep SDfile
Find this compound or compounds like it in BindingDB:
Activity Spreadsheet -- Enzyme Inhibition Constant Data from BindingDB
Found 1 hit for monomerid = 50126138
TargetCruzipain(Trypanosoma cruzi)
University Of California
Curated by ChEMBL
LigandPNGBDBM50126138(CHEMBL3628938)
Affinity DataIC50:  5nM. Assay description: Inhibition of Trypanosoma cruzi recombinant cruzain using Z-FR-AMC as substrate after 5 mins by fluorescence assay
In DepthDetails ArticlePubMed