BDBM50127811 3-Methoxy-N-[2-(2,2,2-trifluoro-1-hydroxy-1-trifluoromethyl-ethyl)-naphthalen-1-yl]-benzamide::CHEMBL48765
SMILES COc1cccc(c1)C(=O)Nc1c(ccc2ccccc12)C(O)(C(F)(F)F)C(F)(F)F
InChI Key InChIKey=RPRAUIIYWXDNOR-UHFFFAOYSA-N
Data  1 EC50
  Tab Delimited (TSV)   2D SDfile   Computed 3D by Vconf -m prep SDfile
Find this compound or compounds like it in BindingDB:
Activity Spreadsheet -- Enzyme Inhibition Constant Data from BindingDB
Found 1 hit for monomerid = 50127811
TargetATP-sensitive inward rectifier potassium channel 11(Homo sapiens (Human))
Abbott Laboratories
Curated by ChEMBL
LigandPNGBDBM50127811(3-Methoxy-N-[2-(2,2,2-trifluoro-1-hydroxy-1-triflu...)
Affinity DataEC50:  185nM. Assay description: Potassium channel opening activity in vitro using LtK cells transfected with Kir6.2/SUR2B exon 17
In DepthDetails ArticlePubMed