BDBM50127982 1-(2-{4-[1-(4-Fluoro-phenyl)-2,3-dihydro-1H-indol-3-yl]-piperidin-1-yl}-ethyl)-imidazolidin-2-one::CHEMBL556312
SMILES Fc1ccc(cc1)N1CC(C2CCN(CCN3CCNC3=O)CC2)c2ccccc12
InChI Key InChIKey=MJIFNEGWZJIOKW-UHFFFAOYSA-N
Data  2 IC50
  Tab Delimited (TSV)   2D SDfile   Computed 3D by Vconf -m prep SDfile
Find this compound or compounds like it in BindingDB:
Activity Spreadsheet -- Enzyme Inhibition Constant Data from BindingDB
Found 2 hits for monomerid = 50127982
TargetPotassium voltage-gated channel subfamily H member 2(Homo sapiens (Human))
Aventis Pharmaceuticals
Curated by ChEMBL
LigandPNGBDBM50127982(1-(2-{4-[1-(4-Fluoro-phenyl)-2,3-dihydro-1H-indol-...)
Affinity DataIC50:  24nM. Assay description: Inhibition of K+ channel activity in CHO cells expressing HERG Kv11.1
In DepthDetails ArticlePubMed
TargetPotassium voltage-gated channel subfamily H member 2(Homo sapiens (Human))
Aventis Pharmaceuticals
Curated by ChEMBL
LigandPNGBDBM50127982(1-(2-{4-[1-(4-Fluoro-phenyl)-2,3-dihydro-1H-indol-...)
Affinity DataIC50:  23.4nM. Assay description: Inhibition of human ERG
In DepthDetails ArticlePubMed