BDBM50127983 4-(5-Chloro-3-{1-[2-(2-oxo-imidazolidin-1-yl)-ethyl]-piperidin-4-yl}-indol-1-yl)-benzoic acid methyl ester::CHEMBL52999
SMILES COC(=O)c1ccc(cc1)-n1cc(C2CCN(CCN3CCNC3=O)CC2)c2cc(Cl)ccc12
InChI Key InChIKey=WQAXQECJUSMGPP-UHFFFAOYSA-N
Data  2 IC50
  Tab Delimited (TSV)   2D SDfile   Computed 3D by Vconf -m prep SDfile
Find this compound or compounds like it in BindingDB:
Activity Spreadsheet -- Enzyme Inhibition Constant Data from BindingDB
Found 2 hits for monomerid = 50127983
TargetPotassium voltage-gated channel subfamily H member 2(Homo sapiens (Human))
Aventis Pharmaceuticals
Curated by ChEMBL
LigandPNGBDBM50127983(4-(5-Chloro-3-{1-[2-(2-oxo-imidazolidin-1-yl)-ethy...)
Affinity DataIC50:  36nM. Assay description: Inhibition of K+ channel activity in CHO cells expressing HERG Kv11.1
In DepthDetails ArticlePubMed
TargetPotassium voltage-gated channel subfamily H member 2(Homo sapiens (Human))
Aventis Pharmaceuticals
Curated by ChEMBL
LigandPNGBDBM50127983(4-(5-Chloro-3-{1-[2-(2-oxo-imidazolidin-1-yl)-ethy...)
Affinity DataIC50:  36.3nM. Assay description: Inhibition of human ERG
In DepthDetails ArticlePubMed