BDBM50127988 4-[4-(Hydroxy-diphenyl-methyl)-piperidin-1-yl]-1-[4-(1-hydroxy-1-methyl-ethyl)-phenyl]-butan-1-ol::CHEMBL52832
SMILES CC(C)(O)c1ccc(cc1)C(O)CCCN1CCC(CC1)C(O)(c1ccccc1)c1ccccc1
InChI Key InChIKey=DRGRCRRKRGIMMI-UHFFFAOYSA-N
Data  2 IC50
  Tab Delimited (TSV)   2D SDfile   Computed 3D by Vconf -m prep SDfile
Find this compound or compounds like it in BindingDB:
Activity Spreadsheet -- Enzyme Inhibition Constant Data from BindingDB
Found 2 hits for monomerid = 50127988
TargetPotassium voltage-gated channel subfamily H member 2(Homo sapiens (Human))
Aventis Pharmaceuticals
Curated by ChEMBL
LigandPNGBDBM50127988(4-[4-(Hydroxy-diphenyl-methyl)-piperidin-1-yl]-1-[...)
Affinity DataIC50:  460nM. Assay description: Inhibition of K+ channel activity in CHO cells expressing HERG Kv11.1
In DepthDetails ArticlePubMed
TargetPotassium voltage-gated channel subfamily H member 2(Homo sapiens (Human))
Aventis Pharmaceuticals
Curated by ChEMBL
LigandPNGBDBM50127988(4-[4-(Hydroxy-diphenyl-methyl)-piperidin-1-yl]-1-[...)
Affinity DataIC50:  457nM. Assay description: Inhibition of human ERG
In DepthDetails ArticlePubMed